Target
D(1A) dopamine receptor
Ligand
BDBM372097
Substrate
Meas. Tech.
In Vitro Binding Assay for DDR1
IC50
80.0±n/a nM
Citation
 Buettelmann, BKocer, BKuhn, BPrunotto, MRichter, HRitter, MRudolph, MSatz, AL Triaza-spirodecanones as DDR1 inhibitors US Patent  US10239876 Publication Date 3/26/2019 
Target
Name:
D(1A) dopamine receptor
Synonyms:
DA D1 receptor DRD1 Dopamine D1 receptor Dopamine D1A
Type:
Enzyme
Mol. Mass.:
49303.43
Organism:
Homo sapiens (Human)
Description:
P21728
Residue:
446
  
Inhibitor
Name:
BDBM372097
Synonyms:
N-(5-cyano-1,3-thiazol-2-yl)-2-[4-oxo-1-phenyl-8-(1H-pyrazolo[3,4-b]pyridine-5-carbonyl)-1,3,8-triazaspiro[4.5]decan-3-yl]acetamide US10435407, Example 120
Type:
Small organic molecule
Emp. Form.:
C26H23N9O3S
Mol. Mass.:
541.584
SMILES:
O=C(CN1CN(c2ccccc2)C2(CCN(CC2)C(=O)c2cnc3[nH]ncc3c2)C1=O)Nc1ncc(s1)C#N
: