Target
cGMP-dependent 3',5'-cyclic phosphodiesterase
Ligand
BDBM372183
Substrate
Meas. Tech.
IMAP TR-FRET-based phosphodiesterase assay
IC50
<100.0±n/a nM
Citation
 Allan, ALBreitenbucher, JGomez, LKeenan, TPLemus, RLy, KMarrone, TJ Substituted 5-methyl-[1,2,4]triazolo[1,5-a]pyrimidin-2-amine compounds as PDE2 inhibitors US Patent  US10239882 Publication Date 3/26/2019 
Target
Name:
cGMP-dependent 3',5'-cyclic phosphodiesterase
Synonyms:
CGS-PDE Homo sapiens phosphodiesterase 2A (PDE2A) PDE2A cGSPDE
Type:
Enzyme Catalytic Domain
Mol. Mass.:
105691.58
Organism:
Homo sapiens (Human)
Description:
O00408
Residue:
941
  
Inhibitor
Name:
BDBM372183
Synonyms:
US10239882, Example 30
Type:
Small organic molecule
Emp. Form.:
C19H22FN5O2
Mol. Mass.:
371.4087
SMILES:
COc1ccc(CNc2nc3nc(CF)cc(C4CCOCC4)n3n2)cc1
: