Target
cGMP-dependent 3',5'-cyclic phosphodiesterase
Ligand
BDBM372242
Substrate
Meas. Tech.
IMAP TR-FRET-based phosphodiesterase assay
IC50
550±n/a nM
Citation
 Allan, ALBreitenbucher, JGomez, LKeenan, TPLemus, RLy, KMarrone, TJ Substituted 5-methyl-[1,2,4]triazolo[1,5-a]pyrimidin-2-amine compounds as PDE2 inhibitors US Patent  US10239882 Publication Date 3/26/2019 
Target
Name:
cGMP-dependent 3',5'-cyclic phosphodiesterase
Synonyms:
CGS-PDE Homo sapiens phosphodiesterase 2A (PDE2A) PDE2A cGSPDE
Type:
Enzyme Catalytic Domain
Mol. Mass.:
105691.58
Organism:
Homo sapiens (Human)
Description:
O00408
Residue:
941
  
Inhibitor
Name:
BDBM372242
Synonyms:
US10239882, Example 63
Type:
Small organic molecule
Emp. Form.:
C20H21N7
Mol. Mass.:
359.4276
SMILES:
Cc1nn(cc1CNc1nc2nc(C)cc(C3CC3)n2n1)-c1ccccc1
: