Target
Tyrosine-protein kinase Lck
Ligand
BDBM340191
Substrate
Meas. Tech.
Lck Enzyme Activity
EC50
>1000±n/a nM
Citation
 Barf, TAJans, CGde Man, APOubrie, AARaaijmakers, HCRewinkel, JBSterrenburg, JGWijkmans, JC 4-imidazopyridazin-1-yl-benzamides as BTK inhibitors US Patent  US10239883 Publication Date 3/26/2019 
Target
Name:
Tyrosine-protein kinase Lck
Synonyms:
2.7.10.2 LCK_HUMAN Leukocyte C-terminal Src kinase Lymphocyte-specific protein tyrosine kinase Protein YT16 Proto-oncogene tyrosine-protein kinase LCK T cell-specific protein-tyrosine kinase
Type:
Mol. Mass.:
57987.83
Organism:
Homo sapiens (Human)
Description:
P06239
Residue:
509
  
Inhibitor
Name:
BDBM340191
Synonyms:
(S,E)-4-(8-amino-3-(1-(4- methoxybut-2-enoyl)pyrrolidin-2- yl)imidazo[1,5-a]pyrazin-1-yl)-N-(4- (trifluoromethyl)pyridin-2- yl)benzamide US10934296, Example 128 | US9758524, Example 128
Type:
Small organic molecule
Emp. Form.:
C28H26F3N7O3
Mol. Mass.:
565.5463
SMILES:
COC\C=C\C(=O)N1CCC[C@H]1c1nc(-c2ccc(cc2)C(=O)Nc2cc(ccn2)C(F)(F)F)c2c(N)nccn12
: