Target
Proto-oncogene tyrosine-protein kinase Src
Ligand
BDBM340101
Substrate
Meas. Tech.
Src Enzyme Activity
EC50
>1000±n/a nM
Citation
 Barf, TAJans, CGde Man, APOubrie, AARaaijmakers, HCRewinkel, JBSterrenburg, JGWijkmans, JC 4-imidazopyridazin-1-yl-benzamides as BTK inhibitors US Patent  US10239883 Publication Date 3/26/2019 
Target
Name:
Proto-oncogene tyrosine-protein kinase Src
Synonyms:
Calmodulin/Proto-oncogene tyrosine-protein kinase Src Proto-oncogene c-Src SRC SRC_HUMAN V-src sarcoma (Schmidt-Ruppin A-2) viral oncogene homolog (avian) p60-Src | pp60c-src
Type:
Protein
Mol. Mass.:
59838.60
Organism:
Homo sapiens (Human)
Description:
P12931
Residue:
536
  
Inhibitor
Name:
BDBM340101
Synonyms:
(S,E)-4-(8-amino-3-(1-(4- methoxybut-2-enoyl)piperidin-2- yl)imidazo[1,5-a]pyrazin-1-yl)-N-(4- fluoropyridin-2-yl)benzamide US10934296, Example 81 | US9758524, Example 81
Type:
Small organic molecule
Emp. Form.:
C28H28FN7O3
Mol. Mass.:
529.5654
SMILES:
COC\C=C\C(=O)N1CCCC[C@H]1c1nc(-c2ccc(cc2)C(=O)Nc2cc(F)ccn2)c2c(N)nccn12
: