Target
Muscarinic acetylcholine receptor M4
Ligand
BDBM372275
Substrate
Meas. Tech.
Cell-Based Functional Assay of Muscarinic Acetylcholine Receptor Activity
EC50
>10000±n/a nM
Citation
 Lindsley, CWConn, PJEngers, DWBollinger, STarr, JCSpearing, PEngers, JLLong, MBridges, TM Positive allosteric modulators of the muscarinic acetylcholine receptor M4 US Patent  US10239887 Publication Date 3/26/2019 
Target
Name:
Muscarinic acetylcholine receptor M4
Synonyms:
ACM4_RAT Chrm-4 | Chrm4
Type:
Enzyme Catalytic Domain
Mol. Mass.:
52841.70
Organism:
RAT
Description:
Cholinergic, muscarinic M4 CHRM4 RAT::P08485
Residue:
477
  
Inhibitor
Name:
BDBM372275
Synonyms:
8-methyl-4- (pyrrolidin-1-yl) pyrido[3',2':4,5]thieno [3,2-d]pyrimidine | US10239887, Cpd. No. 15
Type:
Small organic molecule
Emp. Form.:
C14H14N4S
Mol. Mass.:
270.353
SMILES:
Cc1cnc2sc3c(ncnc3c2c1)N1CCCC1
: