Target
Muscarinic acetylcholine receptor M4
Ligand
BDBM372279
Substrate
Meas. Tech.
Cell-Based Functional Assay of Muscarinic Acetylcholine Receptor Activity
EC50
807±n/a nM
Citation
 Lindsley, CWConn, PJEngers, DWBollinger, STarr, JCSpearing, PEngers, JLLong, MBridges, TM Positive allosteric modulators of the muscarinic acetylcholine receptor M4 US Patent  US10239887 Publication Date 3/26/2019 
Target
Name:
Muscarinic acetylcholine receptor M4
Synonyms:
ACM4_HUMAN Cholinergic, muscarinic M4 Muscarinic acetylcholine receptor M2 and M4
Type:
Enzyme Catalytic Domain
Mol. Mass.:
53079.31
Organism:
Homo sapiens (Human)
Description:
Cholinergic, muscarinic M4 CHRM4 HUMAN M3::P08173
Residue:
479
  
Inhibitor
Name:
BDBM372279
Synonyms:
4-(azetidin-1-yl)-8- methylpyrido[3',2':4,5] thieno[3,2-d]pyrimidine | US10239887, Cpd. No. 18
Type:
Small organic molecule
Emp. Form.:
C13H12N4S
Mol. Mass.:
256.326
SMILES:
Cc1cnc2sc3c(ncnc3c2c1)N1CCC1
: