Target
Muscarinic acetylcholine receptor M4
Ligand
BDBM372289
Substrate
Meas. Tech.
Cell-Based Functional Assay of Muscarinic Acetylcholine Receptor Activity
EC50
10000±n/a nM
Citation
 Lindsley, CWConn, PJEngers, DWBollinger, STarr, JCSpearing, PEngers, JLLong, MBridges, TM Positive allosteric modulators of the muscarinic acetylcholine receptor M4 US Patent  US10239887 Publication Date 3/26/2019 
Target
Name:
Muscarinic acetylcholine receptor M4
Synonyms:
ACM4_HUMAN Cholinergic, muscarinic M4 Muscarinic acetylcholine receptor M2 and M4
Type:
Enzyme Catalytic Domain
Mol. Mass.:
53079.31
Organism:
Homo sapiens (Human)
Description:
Cholinergic, muscarinic M4 CHRM4 HUMAN M3::P08173
Residue:
479
  
Inhibitor
Name:
BDBM372289
Synonyms:
N-(3-fluoro-4- methoxybenzyl)-3,4- dimethylpyrimido [4',5':4,5]thieno[2,3-c] pyridazin-8-amine | US10239887, Cpd. No. 27
Type:
Small organic molecule
Emp. Form.:
C18H16FN5OS
Mol. Mass.:
369.416
SMILES:
COc1ccc(CNc2ncnc3c2sc2nnc(C)c(C)c32)cc1F
: