Target
Interleukin-22 receptor subunit alpha-2
Ligand
BDBM261508
Substrate
Meas. Tech.
TH17 Cytokine Inhibition ELISA
IC50
>10000±n/a nM
Citation
 Gaweco, ATilley, JWWalker, JPalmer, SBlinn, J ROR modulators and their uses US Patent  US9708268 Publication Date 7/18/2017 
Target
Name:
Interleukin-22 receptor subunit alpha-2
Synonyms:
IL-22 receptor subunit alpha-2 I22R2_HUMAN IL-22RA2 | IL22RA2
Type:
Enzyme Catalytic Domain
Mol. Mass.:
30556.44
Organism:
Homo sapiens (Human)
Description:
Q969J5
Residue:
263
  
Inhibitor
Name:
BDBM261508
Synonyms:
1-(4-(1,1,1,3,3,3-hexafluoro-2-hydroxypropan-2-yl)benzyl)indoline-5-carboxamide | US9708268, 11
Type:
Small organic molecule
Emp. Form.:
C8H8BrN
Mol. Mass.:
198.06
SMILES:
Brc1ccc2NCCc2c1
: