Target
Gag-Pol polyprotein [A364V]
Ligand
BDBM372394
Substrate
Meas. Tech.
HIV Cell Culture Assay
EC50
3000±n/a nM
Citation
 Sit, SChen, YChen, JSwidorski, JVenables, BLSin, NMeanwell, NARegueiro-Ren, AHartz, RAXu, LLiu, Z Triterpenoids with HIV maturation inhibitory activity US Patent  US10245275 Publication Date 4/2/2019 
Target
Name:
Gag-Pol polyprotein [A364V]
Synonyms:
HIV-1 NL4-3 POL_HV1N5 | gag-pol
Type:
Enzyme Catalytic Domain
Mol. Mass.:
161848.10
Organism:
Human immunodeficiency virus type 1 group M subtype B (isolate NY5) (HIV-1)
Description:
P12497[A364V]
Residue:
1435
  
Inhibitor
Name:
BDBM372394
Synonyms:
Preparation of (S)-4-((1R,3aS,5aR,5bR,7aR,11aS,11bR,13aR,13bR)-3a-((3,3-dicyclopropylallyl)amino)-5a,5b,8,8,11a-pentamethyl-1-(prop-1-en-2-yl)-2,3,3a,4,5,5a,5b,6,7,7a,8,11,11a,11b,12,13,13a,13b-octadecahydro-1H-cyclopenta[a]chrysen-9-yl)-1-(fluoromethyl)cyclohex-3-enecarboxylic acid | US10245275, Example 2-6
Type:
Small organic molecule
Emp. Form.:
C46H68FNO2
Mol. Mass.:
686.036
SMILES:
[#6]-[#6](=[#6])-[#6@@H]-1-[#6]-[#6][C@@]2([#6]-[#6][C@]3([#6])[#6@H](-[#6]-[#6]-[#6@@H]4[C@@]5([#6])[#6]-[#6]=[#6](-[#6]-6=[#6]-[#6][C@@]([#6]F)([#6]-[#6]-6)[#6](-[#8])=O)C([#6])([#6])[#6@@H]5-[#6]-[#6][C@@]34[#6])-[#6@@H]-12)[#7]-[#6]\[#6]=[#6](/[#6]-1-[#6]-[#6]1)-[#6]-1-[#6]-[#6]-1
: