Target
Gag-Pol polyprotein [A364V]
Ligand
BDBM372420
Substrate
Meas. Tech.
HIV Cell Culture Assay
EC50
170±n/a nM
Citation
 Sit, SChen, YChen, JSwidorski, JVenables, BLSin, NMeanwell, NARegueiro-Ren, AHartz, RAXu, LLiu, Z Triterpenoids with HIV maturation inhibitory activity US Patent  US10245275 Publication Date 4/2/2019 
Target
Name:
Gag-Pol polyprotein [A364V]
Synonyms:
HIV-1 NL4-3 POL_HV1N5 | gag-pol
Type:
Enzyme Catalytic Domain
Mol. Mass.:
161848.10
Organism:
Human immunodeficiency virus type 1 group M subtype B (isolate NY5) (HIV-1)
Description:
P12497[A364V]
Residue:
1435
  
Inhibitor
Name:
BDBM372420
Synonyms:
US10245275, Compound 2b
Type:
Small organic molecule
Emp. Form.:
C43H67FN2O4S
Mol. Mass.:
727.066
SMILES:
CC(=C)[C@@H]1CC[C@@]2(CC[C@]3(C)[C@H](CC[C@@H]4[C@@]5(C)CC=C(C6=CC[C@](CF)(CC6)OC=O)C(C)(C)[C@@H]5CC[C@@]34C)[C@@H]12)NCCN1CCS(=O)(=O)CC1
: