Target
Prostaglandin G/H synthase 1
Ligand
BDBM22342
Substrate
BDBM22319
Meas. Tech.
COX Inhibitor Screening Assay
pH
8±n/a
Temperature
310.15±n/a K
IC50
125000±n/a nM
Citation
 Geronikaki, AALagunin, AAHadjipavlou-Litina, DIEleftheriou, PTFilimonov, DAPoroikov, VVAlam, ISaxena, AK Computer-aided discovery of anti-inflammatory thiazolidinones with dual cyclooxygenase/lipoxygenase inhibition. J Med Chem 51:1601-9 (2008)  
Target
Name:
Prostaglandin G/H synthase 1
Synonyms:
COX1 Cyclooxygenase-1 (COX-1) PTGS1 | Prostaglandin G/H synthase (cyclooxygenase)
Type:
Protein
Mol. Mass.:
68868.60
Organism:
Ovis aries (Sheep)
Description:
Residue:
600
  
Inhibitor
Name:
BDBM22342
Synonyms:
(5E)-5-[(3-chlorophenyl)methylidene]-2-(1,3-thiazol-2-ylamino)-4,5-dihydro-1,3-thiazol-4-one | thiazolidinone derivative, 7
Type:
Small organic molecule
Emp. Form.:
C13H8ClN3OS2
Mol. Mass.:
321.805
SMILES:
Clc1cccc(C=C2SC(Nc3nccs3)=NC2=O)c1
:
Substrate
Name:
BDBM22319
Synonyms:
(5Z,8Z,11Z,14Z)-icosa-5,8,11,14-tetraenoic acid Arachidonic acid (AA) [1-14C]Arachidonic acid
Type:
Unsaturated fatty acid
Emp. Form.:
C20H32O2
Mol. Mass.:
304.4669
SMILES:
CCCCC\C=C/C\C=C/C\C=C/C\C=C/CCCC(O)=O
: