Target
Oxysterols receptor LXR-beta
Ligand
BDBM372422
Substrate
Meas. Tech.
Gal4 LXRbeta Cotransfection Assay
EC50
<1000±n/a nM
Citation
 Mohan, R Liver X receptor (LXR) modulators US Patent  US10246419 Publication Date 4/2/2019 
Target
Name:
Oxysterols receptor LXR-beta
Synonyms:
LXRB Liver X, LXR beta NR1H2 Nuclear receptor NER Ubiquitously-expressed nuclear receptor
Type:
Enzyme Catalytic Domain
Mol. Mass.:
50978.79
Organism:
Homo sapiens (Human)
Description:
P55055
Residue:
460
  
Inhibitor
Name:
BDBM372422
Synonyms:
US10246419, Compound 5
Type:
Small organic molecule
Emp. Form.:
C22H23F3N2O3S
Mol. Mass.:
452.49
SMILES:
CC(C)Cn1nc(cc1-c1ccc(cc1)-c1ccc(CO)c(c1)S(C)(=O)=O)C(F)(F)F
: