Target
Voltage-dependent T-type calcium channel subunit alpha-1H
Ligand
BDBM372542
Substrate
Meas. Tech.
Measurement of Calcium Channel Flux by Means of FLIPR Assay
IC50
22.0±n/a nM
Citation
 Bezencon, OGatfield, JHeidmann, BSiegrist, RStamm, S Triazole compounds as T-type calcium channel blockers US Patent  US10246426 Publication Date 4/2/2019 
Target
Name:
Voltage-dependent T-type calcium channel subunit alpha-1H
Synonyms:
CAC1H_HUMAN Low-voltage-activated calcium channel alpha1 3.2 subunit Voltage-gated calcium channel voltage-dependent T-type calcium channel subunit alpha-1H isoform a
Type:
Enzyme Catalytic Domain
Mol. Mass.:
259187.68
Organism:
Homo sapiens (Human)
Description:
Calcium channel (Type T,L) 0 0::O95180
Residue:
2353
  
Inhibitor
Name:
BDBM372542
Synonyms:
N-[2-(4-Cyano-benzyl)-2H-[1,2,3]triazol4-yl]-2-(1,3-dimethyl-1H-indol-5-yl)-acetamide | US10246426, Example 100
Type:
Small organic molecule
Emp. Form.:
C22H20N6O
Mol. Mass.:
384.4338
SMILES:
Cc1cn(C)c2ccc(CC(=O)Nc3cnn(Cc4ccc(cc4)C#N)n3)cc12
: