Target
Steroidogenic factor 1
Ligand
BDBM22377
Substrate
Biotinylated DAX-1 Peptide
Meas. Tech.
FRET Assay for LRH-1
EC50
170±n/a nM
Citation
 Whitby, RJDixon, SMaloney, PRDelerive, PGoodwin, BJParks, DJWillson, TM Identification of small molecule agonists of the orphan nuclear receptors liver receptor homolog-1 and steroidogenic factor-1. J Med Chem 49:6652-5 (2006)  
Target
Name:
Steroidogenic factor 1
Synonyms:
AD4BP FTZF1 NR5A1 SF-1 STF-1 Steroid hormone receptor Ad4BP
Type:
Nuclear Hormone Receptor
Mol. Mass.:
51643.43
Organism:
Homo sapiens (Human)
Description:
Residue:
461
  
Inhibitor
Name:
BDBM22377
Synonyms:
(3aS,6aR)-4-(4-bromophenyl)-5-[(4E)-oct-4-en-4-yl]-N-phenyl-1,2,3,3a,6,6a-hexahydropentalen-3a-amine | bicyclo[3.3.0]-oct-2-ene, 5e
Type:
Small organic molecule
Emp. Form.:
C28H34BrN
Mol. Mass.:
464.48
SMILES:
[H][C@]12CCC[C@@]1(Nc1ccccc1)C(=C(C2)C(\CCC)=C\CCC)c1ccc(Br)cc1
:
Substrate
Name:
Biotinylated DAX-1 Peptide
Synonyms:
Type:
Peptide
Mol. Mass.:
3435.91
Organism:
Description:
A peptide derived from DAX-1 amino acids 1-23.
Residue:
30