Target
Beta-secretase 1
Ligand
BDBM372788
Substrate
Meas. Tech.
In Vitro Enzymatic BACE1 and BACE2 FRET (Fluorescence Resonance Energy Transfer) Assays
IC50
1.000±n/a nM
Citation
 Allen, JRAmegadzie, ABourbeau, MPBrown, JAChen, NFrohn, MJLiu, LLiu, QPettus, LHQian, WReeves, CMSiegmund, AC Vinyl fluoride cyclopropyl fused thiazin-2-amine compounds as beta-secretase inhibitors and methods of use US Patent  US10246429 Publication Date 4/2/2019 
Target
Name:
Beta-secretase 1
Synonyms:
ASP2 Aspartyl protease 2 BACE1 Beta-secretase (BACE) Beta-secretase 1 (BACE 1) Beta-secretase 1 (BACE1) Beta-site amyloid precursor protein cleaving enzyme 1 Memapsin-2 beta-Secretase (BACE-1) | beta-Secretase (BACE1)
Type:
Protein
Mol. Mass.:
55755.10
Organism:
Homo sapiens (Human)
Description:
P56817
Residue:
501
  
Inhibitor
Name:
BDBM372788
Synonyms:
5-((Z)-2-(3-((1S,5S,6S)-3-amino-5-methyl-1-(pyrrolidine-1-carbonyl)-2-thia-4-azabicyclo[4.1.0]hept-3-en-5-yl)-4-fluorophenyl)-1-fluorovinyl)pyrazine-2-carbonitrile | US10246429, Example 204
Type:
Small organic molecule
Emp. Form.:
C24H22F2N6OS
Mol. Mass.:
480.533
SMILES:
C[C@@]1(N=C(N)S[C@]2(C[C@@H]12)C(=O)N1CCCC1)c1cc(\C=C(/F)c2cnc(cn2)C#N)ccc1F
: