Target
Cathepsin D
Ligand
BDBM372792
Substrate
Meas. Tech.
In Vitro Enzymatic Cathepsin D (Cat D) FRET (Fluorescence Resonance Energy Transfer) Assay
IC50
9280±n/a nM
Citation
 Allen, JRAmegadzie, ABourbeau, MPBrown, JAChen, NFrohn, MJLiu, LLiu, QPettus, LHQian, WReeves, CMSiegmund, AC Vinyl fluoride cyclopropyl fused thiazin-2-amine compounds as beta-secretase inhibitors and methods of use US Patent  US10246429 Publication Date 4/2/2019 
Target
Name:
Cathepsin D
Synonyms:
CATD_HUMAN CTSD Cathepsin D heavy chain Cathepsin D precursor
Type:
Enzyme
Mol. Mass.:
44551.72
Organism:
Homo sapiens (Human)
Description:
Human proCathepsin D (SwissProt accession number P07339) was expressed in Sf9 cells, purified, and autoactivated.
Residue:
412
  
Inhibitor
Name:
BDBM372792
Synonyms:
(1S,5S,6S)-3-amino-5-(2-fluoro-5-((Z)-2-fluorovinyl)phenyl)-N,N,5-trimethyl-2-thia-4-azabicyclo[4.1.0]hept-3-ene-1-carboxamide | US10246429, Example 208
Type:
Small organic molecule
Emp. Form.:
C17H19F2N3OS
Mol. Mass.:
351.414
SMILES:
CN(C)C(=O)[C@]12C[C@H]1[C@](C)(N=C(N)S2)c1cc(\C=C/F)ccc1F
: