Target
Beta-secretase 1
Ligand
BDBM372830
Substrate
Meas. Tech.
In Vitro Enzymatic BACE1 and BACE2 FRET (Fluorescence Resonance Energy Transfer) Assays
IC50
0.400±n/a nM
Citation
 Allen, JRAmegadzie, ABourbeau, MPBrown, JAChen, NFrohn, MJLiu, LLiu, QPettus, LHQian, WReeves, CMSiegmund, AC Vinyl fluoride cyclopropyl fused thiazin-2-amine compounds as beta-secretase inhibitors and methods of use US Patent  US10246429 Publication Date 4/2/2019 
Target
Name:
Beta-secretase 1
Synonyms:
ASP2 Aspartyl protease 2 BACE1 Beta-secretase (BACE) Beta-secretase 1 (BACE 1) Beta-secretase 1 (BACE1) Beta-site amyloid precursor protein cleaving enzyme 1 Memapsin-2 beta-Secretase (BACE-1) | beta-Secretase (BACE1)
Type:
Protein
Mol. Mass.:
55755.10
Organism:
Homo sapiens (Human)
Description:
P56817
Residue:
501
  
Inhibitor
Name:
BDBM372830
Synonyms:
(1S,5S,6S)-3-amino-5-(5-((Z)-2-(5-(but-2-yn-1-yloxy)pyrazin-2-yl)-2-fluorovinyl)-2-fluorophenyl)-5-methyl-2-thia-4-azabicyclo[4.1.0]hept-3-ene-1-carboxamide | US10246429, Example 241
Type:
Small organic molecule
Emp. Form.:
C23H21F2N5O2S
Mol. Mass.:
469.507
SMILES:
CC#CCOc1cnc(cn1)C(\F)=C\c1ccc(F)c(c1)[C@@]1(C)N=C(N)S[C@]2(C[C@@H]12)C(N)=O
: