Target
Serine/threonine-protein kinase B-raf [V600E]
Ligand
BDBM210044
Substrate
Meas. Tech.
Time-Resolved Fluorescence Energy Transfer Assay
IC50
2.40±n/a nM
Citation
 Zhou, CWang, SZhang, G Fused tricyclic compounds as Raf kinase inhibitors US Patent  US9895376 Publication Date 2/20/2018 
Target
Name:
Serine/threonine-protein kinase B-raf [V600E]
Synonyms:
B-RAF V600E B-Raf Protein Kinase Mutant (V600E) BRAF BRAF mutant V600E BRAF_HUMAN Protein mono-ADP-ribosyltransferase (PARP3) RAFB1 Serine/threonine-protein kinase B-raf (V600E) V-RAF murine sarcoma viral oncogene homologue B1 mutant (BRAF V600E)
Type:
Mol. Mass.:
84474.98
Organism:
Homo sapiens (Human)
Description:
P15056 V600E
Residue:
766
  
Inhibitor
Name:
BDBM210044
Synonyms:
US10576087, Compound 2.4 US9895376, Compound 2.4
Type:
Small organic molecule
Emp. Form.:
C25H19FN4O3
Mol. Mass.:
442.4418
SMILES:
Cc1cc2[nH]c(nc2cc1F)C1C2Oc3ccc(Oc4ccnc5NC(=O)CCc45)cc3C12
: