Target
Serine/threonine-protein kinase B-raf [V600E]
Ligand
BDBM210021
Substrate
Meas. Tech.
Time-Resolved Fluorescence Energy Transfer Assay
IC50
2.50±n/a nM
Citation
 Zhou, CWang, SZhang, G Fused tricyclic compounds as Raf kinase inhibitors US Patent  US9895376 Publication Date 2/20/2018 
Target
Name:
Serine/threonine-protein kinase B-raf [V600E]
Synonyms:
B-RAF V600E B-Raf Protein Kinase Mutant (V600E) BRAF BRAF mutant V600E BRAF_HUMAN Protein mono-ADP-ribosyltransferase (PARP3) RAFB1 Serine/threonine-protein kinase B-raf (V600E) V-RAF murine sarcoma viral oncogene homologue B1 mutant (BRAF V600E)
Type:
Mol. Mass.:
84474.98
Organism:
Homo sapiens (Human)
Description:
P15056 V600E
Residue:
766
  
Inhibitor
Name:
BDBM210021
Synonyms:
US10576087, Compound 2.27 US9895376, Compound 2.27
Type:
Small organic molecule
Emp. Form.:
C24H18N4O4
Mol. Mass.:
426.4241
SMILES:
Oc1ccc2nc([nH]c2c1)C1C2Oc3ccc(Oc4ccnc5NC(=O)CCc45)cc3C12
: