Target
RAF proto-oncogene serine/threonine-protein kinase [Y340D,Y341D]
Ligand
BDBM210051
Substrate
Meas. Tech.
Time-Resolved Fluorescence Energy Transfer Assay
IC50
<0.250±n/a nM
Citation
 Zhou, CWang, SZhang, G Fused tricyclic compounds as Raf kinase inhibitors US Patent  US9895376 Publication Date 2/20/2018 
Target
Name:
RAF proto-oncogene serine/threonine-protein kinase [Y340D,Y341D]
Synonyms:
C-RAF (Y340D Y341D) RAF proto-oncogene serine/threonine-protein kinase (Y340D/Y341D) RAF1 | RAF1_HUMAN
Type:
Serine/threonine-protein kinase
Mol. Mass.:
72984.33
Organism:
Homo sapiens (Human)
Description:
P04049 Y340D Y341D
Residue:
648
  
Inhibitor
Name:
BDBM210051
Synonyms:
US10576087, Compound 2.29 US9895376, Compound 2.29
Type:
Small organic molecule
Emp. Form.:
C25H18N4O4
Mol. Mass.:
438.4348
SMILES:
O=C1CCc2c(Oc3ccc4OC5C(C5c4c3)c3nc(no3)-c3ccccc3)ccnc2N1
: