Target
RAF proto-oncogene serine/threonine-protein kinase [Y340D,Y341D]
Ligand
BDBM210057
Substrate
Meas. Tech.
Time-Resolved Fluorescence Energy Transfer Assay
IC50
12.0±n/a nM
Citation
 Zhou, CWang, SZhang, G Fused tricyclic compounds as Raf kinase inhibitors US Patent  US9895376 Publication Date 2/20/2018 
Target
Name:
RAF proto-oncogene serine/threonine-protein kinase [Y340D,Y341D]
Synonyms:
C-RAF (Y340D Y341D) RAF proto-oncogene serine/threonine-protein kinase (Y340D/Y341D) RAF1 | RAF1_HUMAN
Type:
Serine/threonine-protein kinase
Mol. Mass.:
72984.33
Organism:
Homo sapiens (Human)
Description:
P04049 Y340D Y341D
Residue:
648
  
Inhibitor
Name:
BDBM210057
Synonyms:
US10576087, Compound 2.35 US9895376, Compound 2.35
Type:
Small organic molecule
Emp. Form.:
C26H19F3N4O3
Mol. Mass.:
492.4493
SMILES:
Cc1cc(Oc2ccnc3NC(=O)CCc23)cc2C3C(Oc12)C3c1nc2ccc(cc2[nH]1)C(F)(F)F
: