Target
Vascular endothelial growth factor A
Ligand
BDBM372990
Substrate
Meas. Tech.
ELISA Assay
EC50
40.0±n/a nM
Citation
 Dixon, DDGrina, JJosey, JARizzi, JPSchlachter, STWallace, EMWang, BWehn, PXu, RYang, H Aryl ethers and uses thereof US Patent  US9896418 Publication Date 2/20/2018 
Target
Name:
Vascular endothelial growth factor A
Synonyms:
VEGF VEGFA VPF Vascular endothelial growth factor A (VEGF) Vascular permeability factor
Type:
Protein
Mol. Mass.:
27063.81
Organism:
Homo sapiens (Human)
Description:
P15692
Residue:
232
  
Inhibitor
Name:
BDBM372990
Synonyms:
US10597366, Compound 60 | US9896418, Compound 60
Type:
Small organic molecule
Emp. Form.:
C16H13F3O4S
Mol. Mass.:
358.332
SMILES:
O[C@@H]1CCc2c1c(ccc2Oc1cc(F)cc(F)c1)S(=O)(=O)CF
: