Target
Vascular endothelial growth factor A
Ligand
BDBM373042
Substrate
Meas. Tech.
ELISA Assay
EC50
6.20±n/a nM
Citation
 Dixon, DDGrina, JJosey, JARizzi, JPSchlachter, STWallace, EMWang, BWehn, PXu, RYang, H Aryl ethers and uses thereof US Patent  US9896418 Publication Date 2/20/2018 
Target
Name:
Vascular endothelial growth factor A
Synonyms:
VEGF VEGFA VPF Vascular endothelial growth factor A (VEGF) Vascular permeability factor
Type:
Protein
Mol. Mass.:
27063.81
Organism:
Homo sapiens (Human)
Description:
P15692
Residue:
395
  
Inhibitor
Name:
BDBM373042
Synonyms:
US10597366, Compound 273 | US9896418, Compound 273
Type:
Small organic molecule
Emp. Form.:
C17H9F6NO2
Mol. Mass.:
373.2493
SMILES:
O[C@H]1c2c(CC1(F)F)c(Oc1cc(F)cc(c1)C#N)ccc2C(F)(F)F
: