Target
Vascular endothelial growth factor A
Ligand
BDBM373043
Substrate
Meas. Tech.
ELISA Assay
EC50
62.0±n/a nM
Citation
 Dixon, DDGrina, JJosey, JARizzi, JPSchlachter, STWallace, EMWang, BWehn, PXu, RYang, H Aryl ethers and uses thereof US Patent  US9896418 Publication Date 2/20/2018 
Target
Name:
Vascular endothelial growth factor A
Synonyms:
VEGF VEGFA VPF Vascular endothelial growth factor A (VEGF) Vascular permeability factor
Type:
Protein
Mol. Mass.:
27063.81
Organism:
Homo sapiens (Human)
Description:
P15692
Residue:
232
  
Inhibitor
Name:
BDBM373043
Synonyms:
US10597366, Compound 304 | US9896418, Compound 304
Type:
Small organic molecule
Emp. Form.:
C16H12BrF3O4S
Mol. Mass.:
437.228
SMILES:
CS(=O)(=O)c1ccc(Oc2cc(F)cc(Br)c2)c2CC(F)(F)[C@@H](O)c12
: