Target
Estrogen-related receptor gamma
Ligand
BDBM22424
Substrate
BDBM20608
Meas. Tech.
Radioligand Displacement Assay
pH
7.4±n/a
Temperature
295.15±n/a K
IC50
130±n/a nM
Citation
 Chao, EYCollins, JLGaillard, SMiller, ABWang, LOrband-Miller, LANolte, RTMcDonnell, DPWillson, TMZuercher, WJ Structure-guided synthesis of tamoxifen analogs with improved selectivity for the orphan ERRgamma. Bioorg Med Chem Lett 16:821-4 (2006)  
Target
Name:
Estrogen-related receptor gamma
Synonyms:
ERR gamma-2 ERR3_HUMAN ESRRG Estrogen-Related Receptor, gamma KIAA0832 Nuclear receptor subfamily 3 group B member 3
Type:
PROTEIN
Mol. Mass.:
51305.00
Organism:
Homo sapiens (Human)
Description:
ChEMBL_1501351
Residue:
458
  
Inhibitor
Name:
BDBM22424
Synonyms:
4-[(1Z)-5-chloro-1-{4-[2-(dimethylamino)ethoxy]phenyl}-2-phenylpent-1-en-1-yl]phenol | 4-hydroxytamoxifen (4-OHT) analog, 4
Type:
Small organic molecule
Emp. Form.:
C27H30ClNO2
Mol. Mass.:
435.986
SMILES:
CN(C)CCOc1ccc(cc1)C(=C(\CCCCl)c1ccccc1)\c1ccc(O)cc1
:
Substrate
Name:
BDBM20608
Synonyms:
4-Hydroxytamoxifen 4-[(1Z)-1-{4-[2-(dimethylamino)ethoxy]phenyl}-2-phenylbut-1-en-1-yl]phenol CHEMBL489 cid_449459
Type:
Small organic molecule
Emp. Form.:
C26H29NO2
Mol. Mass.:
387.514
SMILES:
CC\C(=C(/c1ccc(O)cc1)c1ccc(OCCN(C)C)cc1)c1ccccc1
: