Target
Histone deacetylase 8
Ligand
BDBM19149
Substrate
BDBM22448
Meas. Tech.
Enzyme Inhibition Assay
pH
7.4±n/a
Temperature
295.15±n/a K
Ki
2000±n/a nM
Citation
 Estiu, GGreenberg, EHarrison, CBKwiatkowski, NPMazitschek, RBradner, JEWiest, O Structural Origin of Selectivity in Class II-Selective Histone Deacetylase Inhibitors. J Med Chem 51:2898-906 (2008)  
Target
Name:
Histone deacetylase 8
Synonyms:
HD8 HDAC8_HUMAN Histone deacetylase 8 (HDAC-8) | Human HDAC8
Type:
Enzyme
Mol. Mass.:
41749.60
Organism:
Homo sapiens (Human)
Description:
Q9BY41
Residue:
377
  
Inhibitor
Name:
BDBM19149
Synonyms:
CHEMBL98 SAHA US10188756, Compound SAHA US11505523, Compound SAHA US9353061, SAHA US9695181, Vorinostat Zolinza suberoylanilide hydroxamic acid
Type:
Small organic molecule
Emp. Form.:
C14H20N2O3
Mol. Mass.:
264.3202
SMILES:
ONC(=O)CCCCCCC(=O)Nc1ccccc1
:
Substrate
Name:
BDBM22448
Synonyms:
Fluorophore-conjugated substrate | HDAC assay substrate (17-372, Upstate Biotechnology Inc.)
Type:
Emp. Form.:
Mol. Mass.:
SMILES:
: