Target
Genome polyprotein
Ligand
BDBM65616
Substrate
Meas. Tech.
Pseudotyped HCV particle (HCVpp) reporter assay
EC50
8.0±n/a nM
Citation
 Bilotta, JAChen, ZChi, FChin, EDing, QErickson, SDGabriel, SDJiang, NKocer, BMertz, EPlancher, JWeikert, RJZhang, JZhang, Q Antiviral compounds US Patent  US9693997 Publication Date 7/4/2017 
Target
Name:
Genome polyprotein
Synonyms:
Genome polyprotein RNA polymerase (NS5B)
Type:
Enzyme
Mol. Mass.:
326966.11
Organism:
Hepatitis C virus (HCV)
Description:
Q9WMX2
Residue:
3010
  
Inhibitor
Name:
BDBM65616
Synonyms:
US9693997, 26
Type:
Small organic molecule
Emp. Form.:
C18H16Cl2N6O
Mol. Mass.:
403.265
SMILES:
Nc1nc(Nc2cc(Cl)c(c(Cl)c2)-c2ccc(OCCCC#N)cc2)n[nH]1
: