Target
Genome polyprotein
Ligand
BDBM70717
Substrate
Meas. Tech.
Pseudotyped HCV particle (HCVpp) reporter assay
EC50
332±n/a nM
Citation
 Bilotta, JAChen, ZChi, FChin, EDing, QErickson, SDGabriel, SDJiang, NKocer, BMertz, EPlancher, JWeikert, RJZhang, JZhang, Q Antiviral compounds US Patent  US9693997 Publication Date 7/4/2017 
Target
Name:
Genome polyprotein
Synonyms:
Dipeptidyl peptidase 4 (DPP4) NS3 NS5B NS3-4A Protease NS3/4A protease POLG_HCV77 | RNA polymerase (NS5B)
Type:
Protease Domain
Mol. Mass.:
327221.49
Organism:
Hepatitis C virus (HCV genotype 1a, isolate H)
Description:
P27958
Residue:
3011
  
Inhibitor
Name:
BDBM70717
Synonyms:
US9693997, 230
Type:
Small organic molecule
Emp. Form.:
C19H19ClF3N5O
Mol. Mass.:
425.835
SMILES:
CC(C)(C)Oc1ccc(cc1)-c1c(Cl)cc(Nc2n[nH]c(N)n2)cc1C(F)(F)F
: