Target
Genome polyprotein
Ligand
BDBM70722
Substrate
Meas. Tech.
Pseudotyped HCV particle (HCVpp) reporter assay
EC50
12±n/a nM
Citation
 Bilotta, JAChen, ZChi, FChin, EDing, QErickson, SDGabriel, SDJiang, NKocer, BMertz, EPlancher, JWeikert, RJZhang, JZhang, Q Antiviral compounds US Patent  US9693997 Publication Date 7/4/2017 
Target
Name:
Genome polyprotein
Synonyms:
Dipeptidyl peptidase 4 (DPP4) NS3 NS5B NS3-4A Protease NS3/4A protease POLG_HCV77 | RNA polymerase (NS5B)
Type:
Protease Domain
Mol. Mass.:
327221.49
Organism:
Hepatitis C virus (HCV genotype 1a, isolate H)
Description:
P27958
Residue:
3011
  
Inhibitor
Name:
BDBM70722
Synonyms:
US9693997, 235
Type:
Small organic molecule
Emp. Form.:
C22H20ClF5N6O
Mol. Mass.:
514.879
SMILES:
Nc1nc(Nc2cc(Cl)c(-c3ccc(NC(=O)C4CCC(F)(F)CC4)cc3)c(c2)C(F)(F)F)n[nH]1
: