Target
Free fatty acid receptor 4
Ligand
BDBM261510
Substrate
Meas. Tech.
FLIPR Assay
EC50
2420±n/a nM
Citation
 Chelliah, MChu, HDCox, JMDebenham, JSEagen, KLan, PLondon, CPlotkin, MAShah, USinz, CJSun, ZVaccaro, HMVenkatraman, S Substituted spiropiperidinyl compounds useful as GPR120 agonists US Patent  US9708270 Publication Date 7/18/2017 
Target
Name:
Free fatty acid receptor 4
Synonyms:
FFAR4 G-protein coupled receptor 120 G-protein coupled receptor GT01 GPR120 O3FAR1 PGR4
Type:
PROTEIN
Mol. Mass.:
42256.91
Organism:
Homo sapiens (Human)
Description:
ChEMBL_1508994
Residue:
377
  
Inhibitor
Name:
BDBM261510
Synonyms:
US9708270, 6
Type:
Small organic molecule
Emp. Form.:
C19H25F2NO3
Mol. Mass.:
353.4035
SMILES:
COc1cc(F)c(cc1F)N1CCC2(CCC(CC(O)=O)CC2)CC1
: