Target
Free fatty acid receptor 4
Ligand
BDBM50208148
Substrate
Meas. Tech.
FLIPR Assay
EC50
410±n/a nM
Citation
 Chelliah, MChu, HDCox, JMDebenham, JSEagen, KLan, PLondon, CPlotkin, MAShah, USinz, CJSun, ZVaccaro, HMVenkatraman, S Substituted spiropiperidinyl compounds useful as GPR120 agonists US Patent  US9708270 Publication Date 7/18/2017 
Target
Name:
Free fatty acid receptor 4
Synonyms:
FFAR4 G-protein coupled receptor 120 G-protein coupled receptor GT01 GPR120 O3FAR1 PGR4
Type:
PROTEIN
Mol. Mass.:
42256.91
Organism:
Homo sapiens (Human)
Description:
ChEMBL_1508994
Residue:
377
  
Inhibitor
Name:
BDBM50208148
Synonyms:
CHEMBL3891920 | US9708270, 7
Type:
Small organic molecule
Emp. Form.:
C19H23F4NO3
Mol. Mass.:
389.3844
SMILES:
OC(=O)CC1CCC2(CC1)CCN(CC2)c1cc(OC(F)(F)F)ccc1F
: