Target
Free fatty acid receptor 4
Ligand
BDBM50208084
Substrate
Meas. Tech.
FLIPR Assay
EC50
1670±n/a nM
Citation
 Chelliah, MChu, HDCox, JMDebenham, JSEagen, KLan, PLondon, CPlotkin, MAShah, USinz, CJSun, ZVaccaro, HMVenkatraman, S Substituted spiropiperidinyl compounds useful as GPR120 agonists US Patent  US9708270 Publication Date 7/18/2017 
Target
Name:
Free fatty acid receptor 4
Synonyms:
FFAR4 G-protein coupled receptor 120 G-protein coupled receptor GT01 GPR120 O3FAR1 PGR4
Type:
PROTEIN
Mol. Mass.:
42256.91
Organism:
Homo sapiens (Human)
Description:
ChEMBL_1508994
Residue:
377
  
Inhibitor
Name:
BDBM50208084
Synonyms:
CHEMBL3977361 | US9708270, 8
Type:
Small organic molecule
Emp. Form.:
C19H26ClNO3
Mol. Mass.:
351.868
SMILES:
COc1ccc(Cl)c(c1)N1CCC2(CCC(CC(O)=O)CC2)CC1
: