Target
11-beta-hydroxysteroid dehydrogenase 1
Ligand
BDBM22463
Substrate
BDBM13739
Meas. Tech.
Human 11beta-HSD1 Scintillation Proximity Assay (SPA)
pH
7.2±n/a
Temperature
295.15±n/a K
Ki
25±10 nM
Citation
 Johansson, LFotsch, CBartberger, MDCastro, VMChen, MEmery, MGustafsson, SHale, CHickman, DHoman, EJordan, SRKomorowski, RLi, AMcRae, KMoniz, GMatsumoto, GOrihuela, CPalm, GVeniant, MWang, MWilliams, MZhang, J 2-Amino-1,3-thiazol-4(5H)-ones as Potent and Selective 11beta-Hydroxysteroid Dehydrogenase Type 1 Inhibitors: Enzyme-Ligand Co-Crystal Structure and Demonstration of Pharmacodynamic Effects in C57Bl/6 Mice. J Med Chem 51:2933-43 (2008)  
Target
Name:
11-beta-hydroxysteroid dehydrogenase 1
Synonyms:
11-DH 11-beta-Hydroxysteroid Dehydrogenase 1 (11-beta-HSD1) 11-beta-hydroxysteroid dehydrogenase 1 (11HSD1) Corticosteroid 11-beta-dehydrogenase isozyme 1 (11-beta-HSD-1) Corticosteroid 11-beta-dehydrogenase isozyme 1 (11beta-HSD1) HSD11 HSD11L | SDR26C1
Type:
Enzyme
Mol. Mass.:
32409.16
Organism:
Homo sapiens (Human)
Description:
P28845
Residue:
292
  
Inhibitor
Name:
BDBM22463
Synonyms:
2-Amino-1,3-thiazol-4(5H)-one, 6f | 2-{bicyclo[2.2.1]heptan-1-ylamino}-5-methyl-5-propyl-4,5-dihydro-1,3-thiazol-4-one
Type:
Small organic molecule
Emp. Form.:
C14H22N2OS
Mol. Mass.:
266.402
SMILES:
CCCC1(C)SC(NC23CCC(CC2)C3)=NC1=O
:
Substrate
Name:
BDBM13739
Synonyms:
(1S,2R,10S,11S,14R,15S)-14-hydroxy-14-(2-hydroxyacetyl)-2,15-dimethyltetracyclo[8.7.0.0^{2,7}.0^{11,15}]heptadec-6-ene-5,17-dione [3H]cortisone | cortisone
Type:
Steroid
Emp. Form.:
C21H28O5
Mol. Mass.:
360.444
SMILES:
[H][C@@]12CC[C@](O)(C(=O)CO)[C@@]1(C)CC(=O)[C@@]1([H])[C@@]2([H])CCC2=CC(=O)CC[C@]12C
: