Target
High affinity nerve growth factor receptor
Ligand
BDBM373067
Substrate
Meas. Tech.
Kinase Binding Assay
IC50
<100±n/a nM
Citation
 Allen, SBrandhuber, BJKercher, TKolakowski, GRWinski, SL N-pyrrolidinyl,N′-pyrazolyl-urea, thiourea, guanidine and cyanoguanidine compounds as TrkA kinase inhibitors US Patent  US9896435 Publication Date 2/20/2018 
Target
Name:
High affinity nerve growth factor receptor
Synonyms:
2.7.10.1 NTRK1 NTRK1_HUMAN Neurotrophic tyrosine kinase receptor type 1 Synonyms=MTC TRK1-transforming tyrosine kinase protein TRKA GN Tropomyosin alpha-3 chain/High affinity nerve growth factor receptor Tropomyosin-related kinase A (TrkA) Tyrosine kinase receptor (Trk) Tyrosine kinase receptor A (Trk A) Tyrosine kinase receptor A (TrkA) p140-TrkA
Type:
Mol. Mass.:
87498.18
Organism:
Homo sapiens (Human)
Description:
P04629
Residue:
796
  
Inhibitor
Name:
BDBM373067
Synonyms:
US10851080, Example 15 | US9896435, Example 15
Type:
Small organic molecule
Emp. Form.:
C30H34FN7O3
Mol. Mass.:
559.6345
SMILES:
CCOc1ncc(cn1)-c1nn(c(NC(=O)N[C@@H]2CN(CCOC)C[C@H]2c2ccc(F)cc2)c1C)-c1ccccc1
: