Target
Histone lysine demethylase PHF8
Ligand
BDBM276064
Substrate
Meas. Tech.
PHF8 Assay
IC50
>500±n/a nM
Citation
 Chen, YKNie, ZStafford, JAVeal, JM Histone demethylase inhibitors US Patent  US9896436 Publication Date 2/20/2018 
Target
Name:
Histone lysine demethylase PHF8
Synonyms:
Histone lysine demethylase PHF8 KIAA1111 PHD finger protein 8 PHF8_HUMAN | ZNF422
Type:
Protein
Mol. Mass.:
117889.91
Organism:
Homo sapiens (Human)
Description:
Q9UPP1
Residue:
1060
  
Inhibitor
Name:
BDBM276064
Synonyms:
2-[1-[[2-fluoro-3-(trifluoromethoxy)phenyl]methyl]imidazol-44-yl]-4-(1H-triazol-4-yl)pyridine US10174003, Example 26 | US9896436, Example 26
Type:
Small organic molecule
Emp. Form.:
C18H12F4N6O
Mol. Mass.:
404.3211
SMILES:
Fc1c(Cn2cnc(c2)-c2cc(ccn2)-c2c[nH]nn2)cccc1OC(F)(F)F
: