Target
Lysine-specific demethylase 5B
Ligand
BDBM319641
Substrate
Meas. Tech.
Jarid1B Assay
IC50
<100±n/a nM
Citation
 Chen, YKNie, ZStafford, JAVeal, JM Histone demethylase inhibitors US Patent  US9896436 Publication Date 2/20/2018 
Target
Name:
Lysine-specific demethylase 5B
Synonyms:
CT31 Histone demethylase JARID1B Jumonji/ARID domain-containing protein 1B KDM5B_HUMAN Lysine-specific demethylase 5B (KDM5Flag-5B-FL) PLU1 RBP2-H1 | Retinoblastoma-binding protein 2 homolog 1
Type:
Protein
Mol. Mass.:
175659.67
Organism:
Homo sapiens (Human)
Description:
Q9UGL1
Residue:
1544
  
Inhibitor
Name:
BDBM319641
Synonyms:
4-[5-(trifluoromethyl)-1H-1,2,3-triazol-4-yl]-2- (1-{2-[2-(trifluoromethyl)phenyl]ethyl}-1H- imidazol-4-yl)pyridine US9896436, Example 60
Type:
Small organic molecule
Emp. Form.:
C20H14F6N6
Mol. Mass.:
452.3558
SMILES:
FC(F)(F)c1[nH]nnc1-c1ccnc(c1)-c1cn(CCc2ccccc2C(F)(F)F)cn1
: