Target
Histamine H3 receptor
Ligand
BDBM22540
Substrate
BDBM22530
Meas. Tech.
H3R Radioligand Binding Assay
pH
7.4±n/a
Temperature
298.15±n/a K
Ki
3±0.5 nM
Citation
 Wijtmans, MCelanire, SSnip, EGillard, MRGelens, ECollart, PPVenhuis, BJChristophe, BHulscher, Svan der Goot, HLebon, FTimmerman, HBakker, RALallemand, BILeurs, RTalaga, PEde Esch, IJ 4-benzyl-1H-imidazoles with oxazoline termini as histamine H3 receptor agonists. J Med Chem 51:2944-53 (2008)  
Target
Name:
Histamine H3 receptor
Synonyms:
G-protein coupled receptor 97 HH3R HRH3 Histamine H3 receptor (H3) Histamine receptor (H3 and H4)
Type:
G Protein-Coupled Receptor (GPCR)
Mol. Mass.:
48691.47
Organism:
Homo sapiens (Human)
Description:
Binding assays were using CHO cells stably expressing hH3R receptors.
Residue:
445
  
Inhibitor
Name:
BDBM22540
Synonyms:
4-Benzyl-1H-imidazole derivative, 21 | 4-{[3-(pent-1-yn-1-yl)phenyl]methyl}-1H-imidazole
Type:
Small organic molecule
Emp. Form.:
C15H16N2
Mol. Mass.:
224.3009
SMILES:
CCCC#Cc1cccc(Cc2cnc[nH]2)c1
:
Substrate
Name:
BDBM22530
Synonyms:
N(alpha)-Methylhistamine N-methylhistamine [2-(1H-imidazol-5-yl)ethyl](methyl)amine | [3H]N-alpha-methyl histamine
Type:
radiolabeled ligand
Emp. Form.:
C6H11N3
Mol. Mass.:
125.1716
SMILES:
CNCCc1cnc[nH]1
: