Target
Bifunctional purine biosynthesis protein ATIC
Ligand
BDBM22583
Substrate
BDBM22579
Meas. Tech.
AICAR Tfase Inhibition Assay
pH
7.5±n/a
Temperature
295.15±n/a K
IC50
20100±700 nM
Citation
 Xu, LLi, COlson, AJWilson, IA Crystal structure of avian aminoimidazole-4-carboxamide ribonucleotide transformylase in complex with a novel non-folate inhibitor identified by virtual ligand screening. J Biol Chem 279:50555-65 (2004)  
Target
Name:
Bifunctional purine biosynthesis protein ATIC
Synonyms:
5-aminoimidazole-4-carboxamide ribonucleotide formyltransferase AICAR Tfase ATIC Bifunctional purine biosynthesis protein PURH IMP cyclohydrolase Inosinicase PURH Thymidylate synthase/GAR transformylase/AICAR transformylase
Type:
Protein
Mol. Mass.:
64616.62
Organism:
Homo sapiens (Human)
Description:
P31939
Residue:
592
  
Inhibitor
Name:
BDBM22583
Synonyms:
2,5-dichloro-4-{3-methyl-5-oxo-4-[(E)-2-(4-sulfophenyl)diazen-1-yl]-4,5-dihydro-1H-pyrazol-1-yl}benzene-1-sulfonic acid C.I. Food Yellow 5 yellow 2G
Type:
Small organic molecule
Emp. Form.:
C16H12Cl2N4O7S2
Mol. Mass.:
507.325
SMILES:
Cc1[nH]n(-c2cc(Cl)c(cc2Cl)S(O)(=O)=O)c(=O)c1N=Nc1ccc(cc1)S(O)(=O)=O
:
Substrate
Name:
BDBM22579
Synonyms:
AICAR CHEMBL483849 {[(2R,3S,4R,5R)-5-(5-amino-4-carbamoyl-1H-imidazol-1-yl)-3,4-dihydroxyoxolan-2-yl]methoxy}phosphonic acid
Type:
Nucleoside or nucleotide
Emp. Form.:
C9H15N4O8P
Mol. Mass.:
338.2112
SMILES:
NC(=O)c1ncn([C@@H]2O[C@H](COP(O)(O)=O)[C@@H](O)[C@H]2O)c1N
: