Target
Tyrosine-protein kinase ABL1 [64-515]
Ligand
BDBM230757
Substrate
Meas. Tech.
Radiometric Filter-Binding Assay
IC50
<3.00±n/a nM
Citation
 Furet, PGrotzfeld, RMJahnke, WJones, DManley, PWMarzinzik, APelle, XFSalem, BSchoepfer, J Benzamide derivatives for inhibiting the activity of ABL1, ABL2 and BCR-ABL1 US Patent  US9896444 Publication Date 2/20/2018 
Target
Name:
Tyrosine-protein kinase ABL1 [64-515]
Synonyms:
ABL ABL1_HUMAN Tyrosine-protein kinase ABL1 Tyrosine-protein kinase ABL1 (ABL) | Tyrosine-protein kinase ABL1 (ABL1)
Type:
Enzyme Catalytic Domain
Mol. Mass.:
51539.77
Organism:
Homo sapiens (Human)
Description:
aa 64-515
Residue:
452
  
Inhibitor
Name:
BDBM230757
Synonyms:
US9340537, 11 | US9896444, Example 11
Type:
Small organic molecule
Emp. Form.:
C21H19F3N4O3S
Mol. Mass.:
464.461
SMILES:
Cc1ncc(s1)-c1cc(cnc1N1CC[C@@H](O)C1)C(=O)Nc1ccc(OC(F)(F)F)cc1
: