Target
Tyrosine-protein kinase ABL1 [64-515]
Ligand
BDBM230767
Substrate
Meas. Tech.
Caliper Assay
IC50
1.80±n/a nM
Citation
 Furet, PGrotzfeld, RMJahnke, WJones, DManley, PWMarzinzik, APelle, XFSalem, BSchoepfer, J Benzamide derivatives for inhibiting the activity of ABL1, ABL2 and BCR-ABL1 US Patent  US9896444 Publication Date 2/20/2018 
Target
Name:
Tyrosine-protein kinase ABL1 [64-515]
Synonyms:
ABL ABL1_HUMAN Tyrosine-protein kinase ABL1 Tyrosine-protein kinase ABL1 (ABL) | Tyrosine-protein kinase ABL1 (ABL1)
Type:
Enzyme Catalytic Domain
Mol. Mass.:
51539.77
Organism:
Homo sapiens (Human)
Description:
aa 64-515
Residue:
452
  
Inhibitor
Name:
BDBM230767
Synonyms:
US9340537, 21 | US9896444, Example 21
Type:
Small organic molecule
Emp. Form.:
C20H20F3N5O3
Mol. Mass.:
435.3997
SMILES:
CCN(CCO)c1ncc(cc1-c1ccn[nH]1)C(=O)Nc1ccc(OC(F)(F)F)cc1
: