Target
Tyrosine-protein kinase ABL1 [64-515]
Ligand
BDBM230780
Substrate
Meas. Tech.
Caliper Assay
IC50
1.70±n/a nM
Citation
 Furet, PGrotzfeld, RMJahnke, WJones, DManley, PWMarzinzik, APelle, XFSalem, BSchoepfer, J Benzamide derivatives for inhibiting the activity of ABL1, ABL2 and BCR-ABL1 US Patent  US9896444 Publication Date 2/20/2018 
Target
Name:
Tyrosine-protein kinase ABL1 [64-515]
Synonyms:
ABL ABL1_HUMAN Tyrosine-protein kinase ABL1 Tyrosine-protein kinase ABL1 (ABL) | Tyrosine-protein kinase ABL1 (ABL1)
Type:
Enzyme Catalytic Domain
Mol. Mass.:
51539.77
Organism:
Homo sapiens (Human)
Description:
aa 64-515
Residue:
452
  
Inhibitor
Name:
BDBM230780
Synonyms:
US9340537, 34 | US9896444, Example 34
Type:
Small organic molecule
Emp. Form.:
C21H19F3N6O2
Mol. Mass.:
444.4098
SMILES:
N[C@H]1[C@@H]2CN(C[C@H]12)c1ncc(cc1-c1ccn[nH]1)C(=O)Nc1ccc(OC(F)(F)F)cc1
: