Target
Gag-Pol polyprotein
Ligand
BDBM22681
Substrate
Biotinylated Target DNA
Meas. Tech.
Microtiter Plate Assay for Strand Transfer
pH
7.8±n/a
Temperature
310.15±n/a K
IC50
18±n/a nM
Citation
 Muraglia, EKinzel, OGardelli, CCrescenzi, BDonghi, MFerrara, MNizi, EOrvieto, FPescatore, GLaufer, RGonzalez-Paz, ODi Marco, AFiore, FMonteagudo, EFonsi, MFelock, PJRowley, MSumma, V Design and synthesis of bicyclic pyrimidinones as potent and orally bioavailable HIV-1 integrase inhibitors. J Med Chem 51:861-74 (2008)  
Target
Name:
Gag-Pol polyprotein
Synonyms:
HIV-1 reverse transcriptase (HIV-1 RT) POL_HV1H2 Protease Reverse transcriptase (RT) gag-pol p66 RT
Type:
Protein
Mol. Mass.:
162074.74
Organism:
Human immunodeficiency virus type 1 group M subtype B (isolate HXB2)
Description:
P04585
Residue:
1435
  
Inhibitor
Name:
BDBM22681
Synonyms:
9-(2,2-difluoro-N-methylacetamido)-N-[(4-fluorophenyl)methyl]-3-hydroxy-4-oxo-4H,6H,7H,8H,9H-pyrido[1,2-a]pyrimidine-2-carboxamide | Bicyclic pyrimidinone, 14b
Type:
Small organic molecule
Emp. Form.:
C19H19F3N4O4
Mol. Mass.:
424.3738
SMILES:
CN(C1CCCn2c1nc(C(=O)NCc1ccc(F)cc1)c(O)c2=O)C(=O)C(F)F
:
Substrate
Name:
Biotinylated Target DNA
Synonyms:
3-biotinylated-poly d(GT)10/poly d(CA)10
Type:
Duplex DNA
Mol. Mass.:
358.43
Organism:
Description:
The synthesized HIV long terminal repeat (LTR) sequence ligonucleotides (~30 bp) as the donor substrates were immobilized on microtiter plates in strand transfer assay.
Residue:
3
NA