Target
High affinity nerve growth factor receptor
Ligand
BDBM373090
Substrate
Meas. Tech.
TrkA Receptor
IC50
4800±n/a nM
Citation
 Cooke, AJStump, CAZhang, XLi, CSMao, Q TrkA kinase inhibitors, compositions and methods thereof US Patent  US9896447 Publication Date 2/20/2018 
Target
Name:
High affinity nerve growth factor receptor
Synonyms:
2.7.10.1 NTRK1 NTRK1_HUMAN Neurotrophic tyrosine kinase receptor type 1 Synonyms=MTC TRK1-transforming tyrosine kinase protein TRKA GN Tropomyosin alpha-3 chain/High affinity nerve growth factor receptor Tropomyosin-related kinase A (TrkA) Tyrosine kinase receptor (Trk) Tyrosine kinase receptor A (Trk A) Tyrosine kinase receptor A (TrkA) p140-TrkA
Type:
Mol. Mass.:
87498.18
Organism:
Homo sapiens (Human)
Description:
P04629
Residue:
796
  
Inhibitor
Name:
BDBM373090
Synonyms:
1-(2,3- dimethylphenyl)-3- (3-methyl-1-phenyl- 1H-pyrazol-5- yl)urea | US9896447, Compound 7
Type:
Small organic molecule
Emp. Form.:
C19H20N4O
Mol. Mass.:
320.3883
SMILES:
Cc1cc(NC(=O)Nc2cccc(C)c2C)n(n1)-c1ccccc1
: