Target
High affinity nerve growth factor receptor
Ligand
BDBM373101
Substrate
Meas. Tech.
TrkA Receptor
IC50
280±n/a nM
Citation
 Cooke, AJStump, CAZhang, XLi, CSMao, Q TrkA kinase inhibitors, compositions and methods thereof US Patent  US9896447 Publication Date 2/20/2018 
Target
Name:
High affinity nerve growth factor receptor
Synonyms:
2.7.10.1 NTRK1 NTRK1_HUMAN Neurotrophic tyrosine kinase receptor type 1 Synonyms=MTC TRK1-transforming tyrosine kinase protein TRKA GN Tropomyosin alpha-3 chain/High affinity nerve growth factor receptor Tropomyosin-related kinase A (TrkA) Tyrosine kinase receptor (Trk) Tyrosine kinase receptor A (Trk A) Tyrosine kinase receptor A (TrkA) p140-TrkA
Type:
Mol. Mass.:
87498.18
Organism:
Homo sapiens (Human)
Description:
P04629
Residue:
796
  
Inhibitor
Name:
BDBM373101
Synonyms:
1,3-bis[2- (methylsulfanyl)-4- phenylpyrimidin-5- yl]urea | US9896447, Compound 18
Type:
Small organic molecule
Emp. Form.:
C23H20N6OS2
Mol. Mass.:
460.575
SMILES:
CSc1ncc(NC(=O)Nc2cnc(SC)nc2-c2ccccc2)c(n1)-c1ccccc1
: