Target
High affinity nerve growth factor receptor
Ligand
BDBM373119
Substrate
Meas. Tech.
TrkA Receptor
IC50
2300±n/a nM
Citation
 Cooke, AJStump, CAZhang, XLi, CSMao, Q TrkA kinase inhibitors, compositions and methods thereof US Patent  US9896447 Publication Date 2/20/2018 
Target
Name:
High affinity nerve growth factor receptor
Synonyms:
2.7.10.1 NTRK1 NTRK1_HUMAN Neurotrophic tyrosine kinase receptor type 1 Synonyms=MTC TRK1-transforming tyrosine kinase protein TRKA GN Tropomyosin alpha-3 chain/High affinity nerve growth factor receptor Tropomyosin-related kinase A (TrkA) Tyrosine kinase receptor (Trk) Tyrosine kinase receptor A (Trk A) Tyrosine kinase receptor A (TrkA) p140-TrkA
Type:
Mol. Mass.:
87498.18
Organism:
Homo sapiens (Human)
Description:
P04629
Residue:
796
  
Inhibitor
Name:
BDBM373119
Synonyms:
1-(2-methyl-4- phenylpyrimidin-5- yl)-3-(2-methyl-4- phenyl-1,3-thiazol- 5-yl)urea | US9896447, Compound 36
Type:
Small organic molecule
Emp. Form.:
C22H19N5OS
Mol. Mass.:
401.484
SMILES:
Cc1nc(c(NC(=O)Nc2cnc(C)nc2-c2ccccc2)s1)-c1ccccc1
: