Target
Receptor-interacting serine/threonine-protein kinase 1
Ligand
BDBM356393
Substrate
Meas. Tech.
Fluorescent Polarization Binding (FP Binding) assay
IC50
500±n/a nM
Citation
 Estrada, AAFeng, JAFox, BSweeney, ZK Compounds, compositions and methods US Patent  US9896458 Publication Date 2/20/2018 
Target
Name:
Receptor-interacting serine/threonine-protein kinase 1
Synonyms:
Cell death protein RIP RIP-1 RIPK1 Receptor-interacting protein 1
Type:
Enzyme Catalytic Domain
Mol. Mass.:
75926.99
Organism:
Homo sapiens (Human)
Description:
Q13546
Residue:
671
  
Inhibitor
Name:
BDBM356393
Synonyms:
US10604535, Example 133 US9896458, No. 133
Type:
Small organic molecule
Emp. Form.:
C20H17F2N5O3
Mol. Mass.:
413.3775
SMILES:
CN1c2ncccc2OC[C@H](NC(=O)c2nn(Cc3ccccc3F)cc2F)C1=O
: