Target
Receptor-interacting serine/threonine-protein kinase 1
Ligand
BDBM356431
Substrate
Meas. Tech.
Fluorescent Polarization Binding (FP Binding) assay
IC50
500±n/a nM
Citation
 Estrada, AAFeng, JAFox, BSweeney, ZK Compounds, compositions and methods US Patent  US9896458 Publication Date 2/20/2018 
Target
Name:
Receptor-interacting serine/threonine-protein kinase 1
Synonyms:
Cell death protein RIP RIP-1 RIPK1 Receptor-interacting protein 1
Type:
Enzyme Catalytic Domain
Mol. Mass.:
75926.99
Organism:
Homo sapiens (Human)
Description:
Q13546
Residue:
671
  
Inhibitor
Name:
BDBM356431
Synonyms:
US10604535, Example 163 US9896458, No. 163
Type:
Small organic molecule
Emp. Form.:
C21H18N6O3
Mol. Mass.:
402.406
SMILES:
CN1c2ccccc2OC[C@H](NC(=O)c2nnc(Cc3cccc(c3)C#N)[nH]2)C1=O
: