Target
Vascular endothelial growth factor receptor 2
Ligand
BDBM373273
Substrate
Meas. Tech.
Kinase Enzymatic Assay
IC50
417±n/a nM
Citation
 Yi, CXu, HTao, JLin, SHan, F Polysubstituted pyridine compound, preparation method, use and pharmaceutical composition US Patent  US9902709 Publication Date 2/27/2018 
Target
Name:
Vascular endothelial growth factor receptor 2
Synonyms:
CD_antigen=CD309 Fetal liver kinase 1 (FLK-1) KDR Protein-tyrosine kinase receptor Flk-1 VEGFR-2 VEGFR2 Vascular Endothelial Growth Factor Receptor Kinase 2 Vascular endothelial growth factor receptor 2 (KDR) Vascular endothelial growth factor receptor 2 (VEGFR2) Vascular endothelial growth factor receptor-2 (VEGFR-2)
Type:
Receptor Tyrosine Kinase
Mol. Mass.:
151510.97
Organism:
Homo sapiens (Human)
Description:
P35968
Residue:
1356
  
Inhibitor
Name:
BDBM373273
Synonyms:
FD-2013037 | US9902709, Compound Example 8
Type:
Small organic molecule
Emp. Form.:
C24H19ClF3N5O3
Mol. Mass.:
517.888
SMILES:
COc1c(Oc2ccc(NC(=O)Nc3ccc(Cl)c(c3)C(F)(F)F)cc2)ccnc1-c1cnn(C)c1
: