Target
cAMP and cAMP-inhibited cGMP 3',5'-cyclic phosphodiesterase 10A
Ligand
BDBM194346
Substrate
Meas. Tech.
Homogenous Time-Resolved Fluorescence Resonance Energy Transfer (TR-FRET) Technology
IC50
168±n/a nM
Citation
 Leblond, BTaverne, TChauvignac, CBeausoleil, ECasagrande, ADesire, LPando, MPDonello, JEYang, R Substituted 6, 7-dialkoxy-3-isoquinoline derivatives as inhibitors of phosphodiesterase 10 (PDE 10A) US Patent  US9902710 Publication Date 2/27/2018 
Target
Name:
cAMP and cAMP-inhibited cGMP 3',5'-cyclic phosphodiesterase 10A
Synonyms:
3',5'-cyclic phosphodiesterase PDE10_HUMAN Phosphodiesterase 10A
Type:
Protein
Mol. Mass.:
88412.52
Organism:
Homo sapiens (Human)
Description:
Q9Y233
Residue:
779
  
Inhibitor
Name:
BDBM194346
Synonyms:
US9200016, 28 | US9902710, Compound 28
Type:
Small organic molecule
Emp. Form.:
C23H22N2O2
Mol. Mass.:
358.433
SMILES:
CCOc1cc2cncc(Cc3cnc4ccccc4c3)c2cc1OCC
: